Reaction Details
TargetMelanin-concentrating hormone receptor 1
LigandBDBM50197123
Substrate/Competitorn/a
Meas. Tech.ChEMBL_408729 (CHEMBL908289)
IC50 168±n/a nM
Citation Lynch, JKFreeman, JCJudd, ASIyengar, RMulhern, MZhao, GNapier, JJWodka, DBrodjian, SDayton, BDFalls, DOgiela, CReilly, RMCampbell, TJPolakowski, JSHernandez, LMarsh, KCShapiro, RKnourek-Segel, VDroz, BBush, EBrune, MPreusser, LCFryer, RMReinhart, GAHouseman, KDiaz, GMikhail, ALimberis, JTSham, HLCollins, CAKym, PR Optimization of chromone-2-carboxamide melanin concentrating hormone receptor 1 antagonists: assessment of potency, efficacy, and cardiovascular safety. J Med Chem49:6569-84 (2006) 
 
Melanin-concentrating hormone receptor 1
Name:Melanin-concentrating hormone receptor 1
Type:G Protein-Coupled Receptor (GPCR)
Mol. Mass.:45976.27
Organism:Homo sapiens (Human)
Description:Membranes from CHO-K1 cells stably expressing human MCH1R were used in assays.
Residue:422
BDBM50197123
NameBDBM50197123
Synonyms:CHEMBL214768 N-[1-[(3-fluoro-4-methoxybenzyl)methyl]piperidin-4-yl]-7-fluoro-4-oxo-4H-chromene-2-carboxamide
TypeSmall organic molecule
Emp. Form.C23H22F2N2O4
Mol. Mass.428.4286
SMILESCOc1ccc(CN2CCC(CC2)NC(=O)c2cc(=O)c3ccc(F)cc3o2)cc1F