Reaction Details
TargetPotassium voltage-gated channel subfamily H member 2
LigandBDBM50197129
Substrate/Competitorn/a
Meas. Tech.ChEMBL_408752 (CHEMBL909940)
IC50 14.7±n/a nM
Citation Lynch, JKFreeman, JCJudd, ASIyengar, RMulhern, MZhao, GNapier, JJWodka, DBrodjian, SDayton, BDFalls, DOgiela, CReilly, RMCampbell, TJPolakowski, JSHernandez, LMarsh, KCShapiro, RKnourek-Segel, VDroz, BBush, EBrune, MPreusser, LCFryer, RMReinhart, GAHouseman, KDiaz, GMikhail, ALimberis, JTSham, HLCollins, CAKym, PR Optimization of chromone-2-carboxamide melanin concentrating hormone receptor 1 antagonists: assessment of potency, efficacy, and cardiovascular safety. J Med Chem49:6569-84 (2006) 
 
Potassium voltage-gated channel subfamily H member 2
Name:Potassium voltage-gated channel subfamily H member 2
Type:Multi-pass membrane protein
Mol. Mass.:126672.65
Organism:Homo sapiens (Human)
Description:Q12809
Residue:1159
BDBM50197129
NameBDBM50197129
Synonyms:CHEMBL387309 | N-[1-[(2-fluoro-4-methoxybenzyl)methyl]piperidin-4-yl]-7-fluoro-4-oxo-4H-chromene-2-carboxamide
TypeSmall organic molecule
Emp. Form.C23H22F2N2O4
Mol. Mass.428.4286
SMILESCOc1ccc(CN2CCC(CC2)NC(=O)c2cc(=O)c3ccc(F)cc3o2)c(F)c1