Reaction Details
TargetMelanin-concentrating hormone receptor 1
LigandBDBM50197115
Substrate/Competitorn/a
Meas. Tech.ChEMBL_408729 (CHEMBL908289)
IC50 171±n/a nM
Citation Lynch, JKFreeman, JCJudd, ASIyengar, RMulhern, MZhao, GNapier, JJWodka, DBrodjian, SDayton, BDFalls, DOgiela, CReilly, RMCampbell, TJPolakowski, JSHernandez, LMarsh, KCShapiro, RKnourek-Segel, VDroz, BBush, EBrune, MPreusser, LCFryer, RMReinhart, GAHouseman, KDiaz, GMikhail, ALimberis, JTSham, HLCollins, CAKym, PR Optimization of chromone-2-carboxamide melanin concentrating hormone receptor 1 antagonists: assessment of potency, efficacy, and cardiovascular safety. J Med Chem49:6569-84 (2006) 
 
Melanin-concentrating hormone receptor 1
Name:Melanin-concentrating hormone receptor 1
Type:G Protein-Coupled Receptor (GPCR)
Mol. Mass.:45976.27
Organism:Homo sapiens (Human)
Description:Membranes from CHO-K1 cells stably expressing human MCH1R were used in assays.
Residue:422
BDBM50197115
NameBDBM50197115
Synonyms:CHEMBL425448 | N-[1-[(2,3-dihydro-1,4-benzodioxin-6-yl)methyl]piperidin-4-yl]-7-fluoro-4-oxo-4H-chromene-2-carboxamide
TypeSmall organic molecule
Emp. Form.C24H23FN2O5
Mol. Mass.438.4482
SMILESFc1ccc2c(c1)oc(cc2=O)C(=O)NC1CCN(Cc2ccc3OCCOc3c2)CC1