Reaction Details
TargetPotassium voltage-gated channel subfamily H member 2
LigandBDBM50197114
Substrate/Competitorn/a
Meas. Tech.ChEMBL_408752 (CHEMBL909940)
IC50 6.7±n/a nM
Citation Lynch, JKFreeman, JCJudd, ASIyengar, RMulhern, MZhao, GNapier, JJWodka, DBrodjian, SDayton, BDFalls, DOgiela, CReilly, RMCampbell, TJPolakowski, JSHernandez, LMarsh, KCShapiro, RKnourek-Segel, VDroz, BBush, EBrune, MPreusser, LCFryer, RMReinhart, GAHouseman, KDiaz, GMikhail, ALimberis, JTSham, HLCollins, CAKym, PR Optimization of chromone-2-carboxamide melanin concentrating hormone receptor 1 antagonists: assessment of potency, efficacy, and cardiovascular safety. J Med Chem49:6569-84 (2006) 
 
Potassium voltage-gated channel subfamily H member 2
Name:Potassium voltage-gated channel subfamily H member 2
Type:Multi-pass membrane protein
Mol. Mass.:126672.65
Organism:Homo sapiens (Human)
Description:Q12809
Residue:1159
BDBM50197114
NameBDBM50197114
Synonyms:CHEMBL214767 | N-[1-(1,3-benzodioxol-5-ylmethyl)piperidin-4-yl]-4-oxo-4H-chromene-2-carboxamide
TypeSmall organic molecule
Emp. Form.C23H22N2O5
Mol. Mass.406.4312
SMILESO=C(NC1CCN(Cc2ccc3OCOc3c2)CC1)c1cc(=O)c2ccccc2o1