Reaction Details
TargetMelanin-concentrating hormone receptor 1
LigandBDBM50199218
Substrate/Competitorn/a
Meas. Tech.ChEMBL_411945 (CHEMBL908393)
IC50 40±n/a nM
Citation Tavares, FXAl-Barazanji, KABigham, ECBishop, MJBritt, CSCarlton, DLFeldman, PLGoetz, ASGrizzle, MKGuo, YCHandlon, ALHertzog, DLIgnar, DMLang, DGOtt, RJPeat, AJZhou, HQ Potent, selective, and orally efficacious antagonists of melanin-concentrating hormone receptor 1. J Med Chem49:7095-107 (2006) 
 
Melanin-concentrating hormone receptor 1
Name:Melanin-concentrating hormone receptor 1
Type:G Protein-Coupled Receptor (GPCR)
Mol. Mass.:45976.27
Organism:Homo sapiens (Human)
Description:Membranes from CHO-K1 cells stably expressing human MCH1R were used in assays.
Residue:422
BDBM50199218
NameBDBM50199218
Synonyms:6-(4-bromophenyl)-3-[2-(4-morpholinylmethyl)-6-quinolinyl]-thieno[3,2-d]pyrimidin-4(3H)-one | CHEMBL217158
TypeSmall organic molecule
Emp. Form.C26H21BrN4O2S
Mol. Mass.533.44
SMILESBrc1ccc(cc1)-c1cc2ncn(-c3ccc4nc(CN5CCOCC5)ccc4c3)c(=O)c2s1