Reaction Details
TargetMelanin-concentrating hormone receptor 1
LigandBDBM50199238
Substrate/Competitorn/a
Meas. Tech.ChEMBL_411945 (CHEMBL908393)
IC50 36±n/a nM
Citation Tavares, FXAl-Barazanji, KABigham, ECBishop, MJBritt, CSCarlton, DLFeldman, PLGoetz, ASGrizzle, MKGuo, YCHandlon, ALHertzog, DLIgnar, DMLang, DGOtt, RJPeat, AJZhou, HQ Potent, selective, and orally efficacious antagonists of melanin-concentrating hormone receptor 1. J Med Chem49:7095-107 (2006) 
 
Melanin-concentrating hormone receptor 1
Name:Melanin-concentrating hormone receptor 1
Type:G Protein-Coupled Receptor (GPCR)
Mol. Mass.:45976.27
Organism:Homo sapiens (Human)
Description:Membranes from CHO-K1 cells stably expressing human MCH1R were used in assays.
Residue:422
BDBM50199238
NameBDBM50199238
Synonyms:3-[2-(4-morpholinylmethyl)-6-quinolinyl]-6-[4-(trifluoromethyl)phenyl]thieno[3,2-d]pyrimidin-4(3H)-one | CHEMBL384371
TypeSmall organic molecule
Emp. Form.C27H21F3N4O2S
Mol. Mass.522.541
SMILESFC(F)(F)c1ccc(cc1)-c1cc2ncn(-c3ccc4nc(CN5CCOCC5)ccc4c3)c(=O)c2s1