Reaction Details
TargetMelanin-concentrating hormone receptor 1
LigandBDBM50199236
Substrate/Competitorn/a
Meas. Tech.ChEMBL_411945 (CHEMBL908393)
IC50 3.1±n/a nM
Citation Tavares, FXAl-Barazanji, KABigham, ECBishop, MJBritt, CSCarlton, DLFeldman, PLGoetz, ASGrizzle, MKGuo, YCHandlon, ALHertzog, DLIgnar, DMLang, DGOtt, RJPeat, AJZhou, HQ Potent, selective, and orally efficacious antagonists of melanin-concentrating hormone receptor 1. J Med Chem49:7095-107 (2006) 
 
Melanin-concentrating hormone receptor 1
Name:Melanin-concentrating hormone receptor 1
Type:G Protein-Coupled Receptor (GPCR)
Mol. Mass.:45976.27
Organism:Homo sapiens (Human)
Description:Membranes from CHO-K1 cells stably expressing human MCH1R were used in assays.
Residue:422
BDBM50199236
NameBDBM50199236
Synonyms:6-(4-chlorophenyl)-3-{2-[(4-methyl-1-piperazinyl)methyl]-6-quinolinyl}thieno[3,2-d]pyrimidin-4(3H)-one | CHEMBL214808
TypeSmall organic molecule
Emp. Form.C27H24ClN5OS
Mol. Mass.502.03
SMILESCN1CCN(Cc2ccc3cc(ccc3n2)-n2cnc3cc(sc3c2=O)-c2ccc(Cl)cc2)CC1