Reaction Details
TargetMelanin-concentrating hormone receptor 1
LigandBDBM50199253
Substrate/Competitorn/a
Meas. Tech.ChEMBL_411789 (CHEMBL908945)
IC50 1.3±n/a nM
Citation Tavares, FXAl-Barazanji, KABishop, MJBritt, CSCarlton, DLCooper, JPFeldman, PLGarrido, DMGoetz, ASGrizzle, MKHertzog, DLIgnar, DMLang, DGMcIntyre, MSOtt, RJPeat, AJZhou, HQ 6-(4-chlorophenyl)-3-substituted-thieno[3,2-d]pyrimidin-4(3H)-one-based melanin-concentrating hormone receptor 1 antagonist. J Med Chem49:7108-18 (2006) 
 
Melanin-concentrating hormone receptor 1
Name:Melanin-concentrating hormone receptor 1
Type:G Protein-Coupled Receptor (GPCR)
Mol. Mass.:45976.27
Organism:Homo sapiens (Human)
Description:Membranes from CHO-K1 cells stably expressing human MCH1R were used in assays.
Residue:422
BDBM50199253
NameBDBM50199253
Synonyms:6-(4-chlorophenyl)-3-[6-(1-pyrrolidinylmethyl)-5,6,7,8-tetrahydro-2-naphthalenyl]thieno[3,2-d]pyrimidin-4-(3H)-one | CHEMBL214871
TypeSmall organic molecule
Emp. Form.C27H26ClN3OS
Mol. Mass.476.033
SMILESClc1ccc(cc1)-c1cc2ncn(-c3ccc4CC(CN5CCCC5)CCc4c3)c(=O)c2s1