Reaction Details
TargetD(4) dopamine receptor
LigandBDBM55121
Substrate/Competitorn/a
Meas. Tech.ChEMBL_422463 (CHEMBL911046)
EC50 2.2±n/a nM
Citation Patel, MVKolasa, TMortell, KMatulenko, MAHakeem, AARohde, JJNelson, SLCowart, MDNakane, MMiller, LNUchic, METerranova, MAEl-Kouhen, OFDonnelly-Roberts, DLNamovic, MTHollingsworth, PRChang, RMartino, BRWetter, JMMarsh, KCMartin, RDarbyshire, JFGintant, GHsieh, GCMoreland, RBSullivan, JPBrioni, JDStewart, AO Discovery of 3-methyl-N-(1-oxy-3',4',5',6'-tetrahydro-2'H-[2,4'-bipyridine]-1'-ylmethyl)benzamide (ABT-670), an orally bioavailable dopamine D4 agonist for the treatment of erectile dysfunction. J Med Chem49:7450-65 (2006) 
 
D(4) dopamine receptor
Name:D(4) dopamine receptor
Type:Enzyme
Mol. Mass.:48373.19
Organism:Homo sapiens (Human)
Description:P21917
Residue:419
BDBM55121
NameBDBM55121
Synonyms:3-HYDROXYTYRAMINE HYDROCHLORIDE 4-(2-aminoethyl)pyrocatechol;hydrochloride Dopamine SMR000059081 | cid_65340
TypeSmall organic molecule
Emp. Form.C8H11NO2
Mol. Mass.153.1784
SMILESNCCc1ccc(O)c(O)c1