Reaction Details
TargetD(4) dopamine receptor
LigandBDBM50200043
Substrate/Competitorn/a
Meas. Tech.ChEMBL_422484 (CHEMBL910436)
Ki 32±n/a nM
Citation Patel, MVKolasa, TMortell, KMatulenko, MAHakeem, AARohde, JJNelson, SLCowart, MDNakane, MMiller, LNUchic, METerranova, MAEl-Kouhen, OFDonnelly-Roberts, DLNamovic, MTHollingsworth, PRChang, RMartino, BRWetter, JMMarsh, KCMartin, RDarbyshire, JFGintant, GHsieh, GCMoreland, RBSullivan, JPBrioni, JDStewart, AO Discovery of 3-methyl-N-(1-oxy-3',4',5',6'-tetrahydro-2'H-[2,4'-bipyridine]-1'-ylmethyl)benzamide (ABT-670), an orally bioavailable dopamine D4 agonist for the treatment of erectile dysfunction. J Med Chem49:7450-65 (2006) 
 
D(4) dopamine receptor
Name:D(4) dopamine receptor
Type:Enzyme
Mol. Mass.:48373.19
Organism:Homo sapiens (Human)
Description:P21917
Residue:419
BDBM50200043
NameBDBM50200043
Synonyms:3-methyl-N-(3',4',5',6'-tetrahydro-2'H-[2,4'-bipyridine]-1'-ylmethyl)benzamide | CHEMBL216794
TypeSmall organic molecule
Emp. Form.C19H23N3O
Mol. Mass.309.4054
SMILESCc1cccc(c1)C(=O)NCN1CCC(CC1)c1ccccn1