Reaction Details
TargetD(4) dopamine receptor
LigandBDBM50145075
Substrate/Competitorn/a
Meas. Tech.ChEMBL_422463 (CHEMBL911046)
EC50 12±n/a nM
Citation Patel, MVKolasa, TMortell, KMatulenko, MAHakeem, AARohde, JJNelson, SLCowart, MDNakane, MMiller, LNUchic, METerranova, MAEl-Kouhen, OFDonnelly-Roberts, DLNamovic, MTHollingsworth, PRChang, RMartino, BRWetter, JMMarsh, KCMartin, RDarbyshire, JFGintant, GHsieh, GCMoreland, RBSullivan, JPBrioni, JDStewart, AO Discovery of 3-methyl-N-(1-oxy-3',4',5',6'-tetrahydro-2'H-[2,4'-bipyridine]-1'-ylmethyl)benzamide (ABT-670), an orally bioavailable dopamine D4 agonist for the treatment of erectile dysfunction. J Med Chem49:7450-65 (2006) 
 
D(4) dopamine receptor
Name:D(4) dopamine receptor
Type:Enzyme
Mol. Mass.:48373.19
Organism:Homo sapiens (Human)
Description:P21917
Residue:419
BDBM50145075
NameBDBM50145075
Synonyms:2-((4-(pyridin-2-yl)piperazin-1-yl)methyl)-1H-benzo[d]imidazole ABT-724 | CHEMBL440687
TypeSmall organic molecule
Emp. Form.C17H19N5
Mol. Mass.293.3663
SMILESC(N1CCN(CC1)c1ccccn1)c1nc2ccccc2[nH]1