Reaction Details
TargetMelanin-concentrating hormone receptor 1
LigandBDBM50201271
Substrate/Competitorn/a
Meas. Tech.ChEMBL_421480 (CHEMBL854909)
IC50 11±n/a nM
Citation Souers, AJIyengar, RRJudd, ASBeno, DWGao, JZhao, GBrune, MENapier, JJMulhern, MMLynch, JKFreeman, JCWodka, DChen, CJFalls, HDBrodjian, SDayton, BDDiaz, GJBush, ENShapiro, RDroz, BAKnourek-Segel, VHernandez, LEMarsh, KCReilly, RMSham, HLCollins, CAKym, PR Constrained 7-fluorocarboxychromone-4-aminopiperidine based Melanin-concentrating hormone receptor 1 antagonists: the effects of chirality on substituted indan-1-ylamines. Bioorg Med Chem Lett17:884-9 (2007) 
 
Melanin-concentrating hormone receptor 1
Name:Melanin-concentrating hormone receptor 1
Type:G Protein-Coupled Receptor (GPCR)
Mol. Mass.:45976.27
Organism:Homo sapiens (Human)
Description:Membranes from CHO-K1 cells stably expressing human MCH1R were used in assays.
Residue:422
BDBM50201271
NameBDBM50201271
Synonyms:7-fluoro-4-oxo-N-(1-(2-oxo-3,5,6,7-tetrahydro-2H-indeno[5,6-d]oxazol-5-yl)piperidin-4-yl)-4H-chromene-2-carboxamide | CHEMBL384111
TypeSmall organic molecule
Emp. Form.C25H22FN3O5
Mol. Mass.463.4577
SMILESFc1ccc2c(c1)oc(cc2=O)C(=O)NC1CCN(CC1)C1CCc2cc3oc(=O)[nH]c3cc12