Reaction Details
Target72 kDa type IV collagenase
LigandBDBM50203538
Substrate/Competitorn/a
Meas. Tech.ChEMBL_425539 (CHEMBL911376)
IC50 13±n/a nM
Citation Yao, WZhuo, JBurns, DMXu, MZhang, CLi, YLQian, DQHe, CWeng, LShi, ELin, QAgrios, CBurn, TCCaulder, ECovington, MBFridman, JSFriedman, SKatiyar, KHollis, GLi, YLiu, CLiu, XMarando, CANewton, RPan, MScherle, PTaylor, NVaddi, KWasserman, ZRWynn, RYeleswaram, SJalluri, RBower, MZhou, BBMetcalf, B Discovery of a potent, selective, and orally active human epidermal growth factor receptor-2 sheddase inhibitor for the treatment of cancer. J Med Chem50:603-6 (2007) 
 
72 kDa type IV collagenase
Name:72 kDa type IV collagenase
Type:Enzyme
Mol. Mass.:73870.36
Organism:Homo sapiens (Human)
Description: P08253
Residue:660
BDBM50203538
NameBDBM50203538
Synonyms:(6S,7S)-6-(3-phenyl-2,5-dihydro-pyrrole-1-carbonyl)-5-aza-spiro[2.5]octane-7-carboxylic acid hydroxyamide CHEMBL375418
TypeSmall organic molecule
Emp. Form.C19H23N3O3
Mol. Mass.341.4042
SMILESONC(=O)[C@H]1CC2(CC2)CN[C@@H]1C(=O)N1CC=C(C1)c1ccccc1