Reaction Details
TargetTyrosine-protein kinase JAK2
LigandBDBM50204582
Substrate/Competitorn/a
Meas. Tech.ChEMBL_454474 (CHEMBL886500)
IC50>8333±n/a nM
Citation DiMauro, EFNewcomb, JNunes, JJBemis, JEBoucher, CBuchanan, JLBuckner, WHCheng, AFaust, THsieh, FHuang, XLee, JHMarshall, TLMartin, MWMcGowan, DCSchneider, STurci, SMWhite, RDZhu, X Discovery of 4-amino-5,6-biaryl-furo[2,3-d]pyrimidines as inhibitors of Lck: development of an expedient and divergent synthetic route and preliminary SAR. Bioorg Med Chem Lett17:2305-9 (2007) 
 
Tyrosine-protein kinase JAK2
Name:Tyrosine-protein kinase JAK2
Type:Protein
Mol. Mass.:130684.68
Organism:Homo sapiens (Human)
Description:O60674
Residue:1132
BDBM50204582
NameBDBM50204582
Synonyms:5-phenyl-N-(2-(piperazin-1-yl)ethyl)-6-(4-(2-(pyrrolidin-1-yl)ethoxy)phenyl)furo[2,3-d]pyrimidin-4-amine | CHEMBL247468
TypeSmall organic molecule
Emp. Form.C30H36N6O2
Mol. Mass.512.6458
SMILESC(CN1CCNCC1)Nc1ncnc2oc(c(-c3ccccc3)c12)-c1ccc(OCCN2CCCC2)cc1