Reaction Details
TargetEpidermal growth factor receptor
LigandBDBM50204579
Substrate/Competitorn/a
Meas. Tech.ChEMBL_454469 (CHEMBL902558)
IC50 1029±n/a nM
Citation DiMauro, EFNewcomb, JNunes, JJBemis, JEBoucher, CBuchanan, JLBuckner, WHCheng, AFaust, THsieh, FHuang, XLee, JHMarshall, TLMartin, MWMcGowan, DCSchneider, STurci, SMWhite, RDZhu, X Discovery of 4-amino-5,6-biaryl-furo[2,3-d]pyrimidines as inhibitors of Lck: development of an expedient and divergent synthetic route and preliminary SAR. Bioorg Med Chem Lett17:2305-9 (2007) 
 
Epidermal growth factor receptor
Name:Epidermal growth factor receptor
Type:Receptor Kinase Domain
Mol. Mass.:134279.59
Organism:Homo sapiens (Human)
Description:P00533
Residue:1210
BDBM50204579
NameBDBM50204579
Synonyms:CHEMBL247866 | N-isopropyl-5-phenyl-6-(4-(2-(pyrrolidin-1-yl)ethoxy)phenyl)furo[2,3-d]pyrimidin-4-amine
TypeSmall organic molecule
Emp. Form.C27H30N4O2
Mol. Mass.442.5527
SMILESCC(C)Nc1ncnc2oc(c(-c3ccccc3)c12)-c1ccc(OCCN2CCCC2)cc1