Reaction Details
TargetActivated CDC42 kinase 1
LigandBDBM17714
Substrate/Competitorn/a
Meas. Tech.ChEMBL_454457 (CHEMBL903634)
IC50 181±n/a nM
Citation DiMauro, EFNewcomb, JNunes, JJBemis, JEBoucher, CBuchanan, JLBuckner, WHCheng, AFaust, THsieh, FHuang, XLee, JHMarshall, TLMartin, MWMcGowan, DCSchneider, STurci, SMWhite, RDZhu, X Discovery of 4-amino-5,6-biaryl-furo[2,3-d]pyrimidines as inhibitors of Lck: development of an expedient and divergent synthetic route and preliminary SAR. Bioorg Med Chem Lett17:2305-9 (2007) 
 
Activated CDC42 kinase 1
Name:Activated CDC42 kinase 1
Type:Protein
Mol. Mass.:114577.86
Organism:Homo sapiens (Human)
Description:Q07912
Residue:1038
BDBM17714
NameBDBM17714
Synonyms:5,6-diphenyl-N-[2-(piperazin-1-yl)ethyl]furo[2,3-d]pyrimidin-4-amine CHEMBL247272
TypeSmall organic molecule
Emp. Form.C24H25N5O
Mol. Mass.399.4882
SMILESC(CN1CCNCC1)Nc1ncnc2oc(c(-c3ccccc3)c12)-c1ccccc1