Reaction Details
TargetTyrosine-protein kinase Lck
LigandBDBM50204581
Substrate/Competitorn/a
Meas. Tech.ChEMBL_454458 (CHEMBL902547)
IC50 1210±n/a nM
Citation DiMauro, EFNewcomb, JNunes, JJBemis, JEBoucher, CBuchanan, JLBuckner, WHCheng, AFaust, THsieh, FHuang, XLee, JHMarshall, TLMartin, MWMcGowan, DCSchneider, STurci, SMWhite, RDZhu, X Discovery of 4-amino-5,6-biaryl-furo[2,3-d]pyrimidines as inhibitors of Lck: development of an expedient and divergent synthetic route and preliminary SAR. Bioorg Med Chem Lett17:2305-9 (2007) 
 
Tyrosine-protein kinase Lck
Name:Tyrosine-protein kinase Lck
Type:n/a
Mol. Mass.:57987.83
Organism:Homo sapiens (Human)
Description:P06239
Residue:509
BDBM50204581
NameBDBM50204581
Synonyms:(R)-5,6-diphenyl-N-((tetrahydrofuran-2-yl)methyl)furo[2,3-d]pyrimidin-4-amine | CHEMBL247068
TypeSmall organic molecule
Emp. Form.C23H21N3O2
Mol. Mass.371.4317
SMILESC(Nc1ncnc2oc(c(-c3ccccc3)c12)-c1ccccc1)[C@H]1CCCO1