Reaction Details
TargetAndrogen receptor
LigandBDBM50205116
Substrate/Competitorn/a
Meas. Tech.ChEMBL_438313 (CHEMBL887415)
Ki 1.2±n/a nM
Citation Hamann, LGManfredi, MCSun, CKrystek, SRHuang, YBi, YAugeri, DJWang, TZou, YBetebenner, DAFura, ASeethala, RGolla, RKuhns, JELupisella, JADarienzo, CJCuster, LLPrice, JLJohnson, JMBiller, SAZahler, ROstrowski, J Tandem optimization of target activity and elimination of mutagenic potential in a potent series of N-aryl bicyclic hydantoin-based selective androgen receptor modulators. Bioorg Med Chem Lett17:1860-4 (2007) 
 
Androgen receptor
Name:Androgen receptor
Type:Receptor
Mol. Mass.:99185.27
Organism:Homo sapiens (Human)
Description:CHO cells were stably transfected with human AR gene.
Residue:920
BDBM50205116
NameBDBM50205116
Synonyms:2-bromo-4-((7R,7aS)-7-hydroxy-1,3-dioxo-tetrahydro-1H-pyrrolo[1,2-e]imidazol-2(3H)-yl)-3-methylbenzonitrile | CHEMBL398226
TypeSmall organic molecule
Emp. Form.C14H12BrN3O3
Mol. Mass.350.167
SMILESCc1c(Br)c(ccc1-n1c(O)c2[C@H](O)CCn2c1=O)C#N