Reaction Details
TargetCytosolic phospholipase A2
LigandBDBM50205540
Substrate/Competitorn/a
Meas. Tech.ChEMBL_428330 (CHEMBL917108)
IC50 190±n/a nM
Citation Lee, KLFoley, MAChen, LBehnke, MLLovering, FEKirincich, SJWang, WShim, JTam, SShen, MWKhor, SXu, XGoodwin, DGRamarao, MKNickerson-Nutter, CDonahue, FKu, MSClark, JDMcKew, JC Discovery of Ecopladib, an indole inhibitor of cytosolic phospholipase A2alpha. J Med Chem50:1380-400 (2007) 
 
Cytosolic phospholipase A2
Name:Cytosolic phospholipase A2
Type:Protein
Mol. Mass.:85219.30
Organism:Homo sapiens (Human)
Description:P47712
Residue:749
BDBM50205540
NameBDBM50205540
Synonyms:4-{2-[5-chloro-2-(2-{[(3,5-dichlorobenzyl)sulfonyl]amino}-ethyl)-1-(diphenylmethyl)-1H-indol-3-yl]ethoxy}benzoic acid | CHEMBL223670
TypeSmall organic molecule
Emp. Form.C39H33Cl3N2O5S
Mol. Mass.748.114
SMILESOC(=O)c1ccc(OCCc2c(CCNS(=O)(=O)Cc3cc(Cl)cc(Cl)c3)n(C(c3ccccc3)c3ccccc3)c3ccc(Cl)cc23)cc1