Reaction Details
TargetReceptor-type tyrosine-protein kinase FLT3
LigandBDBM50207491
Substrate/Competitorn/a
Meas. Tech.ChEMBL_429057 (CHEMBL920440)
IC50 55±n/a nM
Citation Dai, YHartandi, KJi, ZAhmed, AAAlbert, DHBauch, JLBouska, JJBousquet, PFCunha, GAGlaser, KBHarris, CMHickman, DGuo, JLi, JMarcotte, PAMarsh, KCMoskey, MDMartin, RLOlson, AMOsterling, DJPease, LJSoni, NBStewart, KDStoll, VSTapang, PReuter, DRDavidsen, SKMichaelides, MR Discovery of N-(4-(3-amino-1H-indazol-4-yl)phenyl)-N'-(2-fluoro-5-methylphenyl)urea (ABT-869), a 3-aminoindazole-based orally active multitargeted receptor tyrosine kinase inhibitor. J Med Chem50:1584-97 (2007) 
 
Receptor-type tyrosine-protein kinase FLT3
Name:Receptor-type tyrosine-protein kinase FLT3
Type:Enzyme
Mol. Mass.:112888.62
Organism:Homo sapiens (Human)
Description:P36888
Residue:993
BDBM50207491
NameBDBM50207491
Synonyms:1-(4-(3-amino-1H-indazol-4-yl)phenyl)-3-(3-ethylphenyl)urea N-(4-(3-amino-1H-indazol-4-yl)phenyl)-N'-(3-ethylphenyl)-urea
TypeSmall organic molecule
Emp. Form.C22H21N5O
Mol. Mass.371.435
SMILESCCc1cccc(NC(=O)Nc2ccc(cc2)-c2cccc3[nH]nc(N)c23)c1