Reaction Details
TargetSodium-dependent serotonin transporter
LigandBDBM50208772
Substrate/Competitorn/a
Meas. Tech.ChEMBL_443351 (CHEMBL893599)
Ki 5.67±n/a nM
Citation Lee, JHChoi, YHLim, YJLee, BSChi, DYJin, C Syntheses and binding affinities of 6-nitroquipazine analogues for serotonin transporter. Part 5: 2'-Substituted 6-nitroquipazines. Bioorg Med Chem15:3499-504 (2007) 
 
Sodium-dependent serotonin transporter
Name:Sodium-dependent serotonin transporter
Type:Multi-pass membrane protein
Mol. Mass.:70168.43
Organism:Rattus norvegicus (rat)
Description:P31652
Residue:630
BDBM50208772
NameBDBM50208772
Synonyms:6-nitro-2-(2-propoxymethylpiperazin-1-yl)quinoline | CHEMBL241864
TypeSmall organic molecule
Emp. Form.C17H22N4O3
Mol. Mass.330.3816
SMILESCCCOCC1CNCCN1c1ccc2cc(ccc2n1)[N+]([O-])=O