Reaction Details
TargetB1 bradykinin receptor
LigandBDBM50209750
Substrate/Competitorn/a
Meas. Tech.ChEMBL_434360 (CHEMBL919419)
Ki 21.8±n/a nM
Citation Biswas, KLi, AChen, JJD'Amico, DCFotsch, CHan, NHuman, JLiu, QNorman, MHRiahi, BYuan, CSuzuki, HMareska, DAZhan, JClarke, DEToro, AGroneberg, RDBurgess, LELester-Zeiner, DBiddlecome, GManning, BHArik, LDong, HHuang, MKamassah, ALoeloff, RSun, HHsieh, FYKumar, GNg, GYHungate, RWAskew, BCJohnson, E Potent nonpeptide antagonists of the bradykinin B1 receptor: structure-activity relationship studies with novel diaminochroman carboxamides. J Med Chem50:2200-12 (2007) 
 
B1 bradykinin receptor
Name:B1 bradykinin receptor
Type:Enzyme
Mol. Mass.:40508.87
Organism:Homo sapiens (Human)
Description:P46663
Residue:353
BDBM50209750
NameBDBM50209750
Synonyms:(R)-N-((R)-7-((cyclohexylamino)methyl)chroman-4-yl)-3-(naphthalene-3-sulfonamido)-3-phenylpropanamide | CHEMBL268911
TypeSmall organic molecule
Emp. Form.C35H39N3O4S
Mol. Mass.597.767
SMILESO=C(C[C@@H](NS(=O)(=O)c1ccc2ccccc2c1)c1ccccc1)N[C@@H]1CCOc2cc(CNC3CCCCC3)ccc12