Reaction Details
TargetMelanocortin receptor 5
LigandBDBM50211395
Substrate/Competitorn/a
Meas. Tech.ChEMBL_434966 (CHEMBL919367)
IC50 990±n/a nM
Citation Bednarek, MAMacNeil, TTang, RFong, TMCabello, MAMaroto, MTeran, A Potent and selective agonists of human melanocortin receptor 5: cyclic analogues of alpha-melanocyte-stimulating hormone. J Med Chem50:2520-6 (2007) 
 
Melanocortin receptor 5
Name:Melanocortin receptor 5
Type:Enzyme
Mol. Mass.:36612.92
Organism:Homo sapiens (Human)
Description:P33032
Residue:325
BDBM50211395
NameBDBM50211395
Synonyms:Ac-Nle4-cyclo(Asp5-Phg6-D-4,4'-Bip7-Pip8-Trp9-Lys10)-NH2 | CHEMBL2371971
TypeSmall organic molecule
Emp. Form.C58H70N10O9
Mol. Mass.1051.238
SMILES[H][C@@]12CCCCN1C(=O)[C@H](Cc1ccc(cc1)-c1ccccc1)NC(=O)[C@@H](NC(=O)[C@H](CC(=O)NCCCC[C@H](NC(=O)[C@H](Cc1c[nH]c3ccccc13)NC2=O)C(N)=O)NC(=O)[C@H](CCCC)NC(C)=O)c1ccccc1