Reaction Details
TargetCytochrome P450 3A4
LigandBDBM50213744
Substrate/Competitorn/a
Meas. Tech.ChEMBL_447520 (CHEMBL895419)
IC50>25000±n/a nM
Citation Wang, YBusch-Petersen, JWang, FMa, LFu, WKerns, JKJin, JPalovich, MRShen, JKBurman, MFoley, JJSchmidt, DBHunsberger, GESarau, HMWiddowson, KL 3-Arylamino-2H-1,2,4-benzothiadiazin-5-ol 1,1-dioxides as novel and selective CXCR2 antagonists. Bioorg Med Chem Lett17:3864-7 (2007) 
 
Cytochrome P450 3A4
Name:Cytochrome P450 3A4
Type:Enzyme
Mol. Mass.:57349.57
Organism:Homo sapiens (Human)
Description:n/a
Residue:503
BDBM50213744
NameBDBM50213744
Synonyms:3-(2-chloro-phenylamino)-7-nitro-1,1-dioxo-1,4-dihydro-1lambda6-benzo[1,2,4]thiadiazin-5-ol | CHEMBL231924
TypeSmall organic molecule
Emp. Form.C13H9ClN4O5S
Mol. Mass.368.752
SMILESOc1cc(cc2c1N=C(Nc1ccccc1Cl)NS2(=O)=O)[N+]([O-])=O