Reaction Details
TargetBeta-3 adrenergic receptor
LigandBDBM50214219
Substrate/Competitorn/a
Meas. Tech.ChEMBL_456291 (CHEMBL888301)
Ki 360±n/a nM
Citation Washburn, WNHarper, TWWu, GGodfrey, JDMcCann, PGirotra, RShao, CZhang, HGavai, AMikkilineni, ADejneka, TAhmed, SCaringal, YHangeland, JZhang, MCheng, PTRussell, ADSkwish, SSlusarchyk, DAAllen, GTFrohlich, BHAbboa-Offei, BECap, MWaldron, TLGeorge, RJTesfamariam, BDickinson, KESeymour, AASher, PM Arylpropanolamines: selective beta3 agonists arising from strategies to mitigate phase I metabolic transformations. Bioorg Med Chem Lett17:4290-6 (2007) 
 
Beta-3 adrenergic receptor
Name:Beta-3 adrenergic receptor
Type:G Protein-Coupled Receptor (GPCR)
Mol. Mass.:43534.88
Organism:Homo sapiens (Human)
Description:n/a
Residue:408
BDBM50214219
NameBDBM50214219
Synonyms:(R)-N-(5-(4-(4-methoxybenzylamino)-3-hydroxybutanoyl)-2-hydroxyphenyl)methanesulfonamide | CHEMBL400669
TypeSmall organic molecule
Emp. Form.C19H24N2O6S
Mol. Mass.408.469
SMILESCOc1ccc(CNC[C@H](O)CC(=O)c2ccc(O)c(NS(C)(=O)=O)c2)cc1