Reaction Details
TargetBeta-3 adrenergic receptor
LigandBDBM50214243
Substrate/Competitorn/a
Meas. Tech.ChEMBL_456291 (CHEMBL888301)
Ki 15000±n/a nM
Citation Washburn, WNHarper, TWWu, GGodfrey, JDMcCann, PGirotra, RShao, CZhang, HGavai, AMikkilineni, ADejneka, TAhmed, SCaringal, YHangeland, JZhang, MCheng, PTRussell, ADSkwish, SSlusarchyk, DAAllen, GTFrohlich, BHAbboa-Offei, BECap, MWaldron, TLGeorge, RJTesfamariam, BDickinson, KESeymour, AASher, PM Arylpropanolamines: selective beta3 agonists arising from strategies to mitigate phase I metabolic transformations. Bioorg Med Chem Lett17:4290-6 (2007) 
 
Beta-3 adrenergic receptor
Name:Beta-3 adrenergic receptor
Type:G Protein-Coupled Receptor (GPCR)
Mol. Mass.:43534.88
Organism:Homo sapiens (Human)
Description:n/a
Residue:408
BDBM50214243
NameBDBM50214243
Synonyms:(R)-N-(5-(4-amino-3-hydroxybutanoyl)-2-hydroxyphenyl)methanesulfonamide | CHEMBL251363
TypeSmall organic molecule
Emp. Form.C11H16N2O5S
Mol. Mass.288.32
SMILESCS(=O)(=O)Nc1cc(ccc1O)C(=O)C[C@@H](O)CN