Reaction Details
TargetHydroxycarboxylic acid receptor 2
LigandBDBM50216537
Substrate/Competitorn/a
Meas. Tech.ChEMBL_456679 (CHEMBL924060)
EC50 8900±n/a nM
Citation Gharbaoui, TSkinner, PJShin, YJAverbuj, CJung, JKJohnson, BRDuong, TDecaire, MUy, JCherrier, MCWebb, PJTamura, SYZou, NRodriguez, NBoatman, PDSage, CRLindstrom, AXu, JSchrader, TOSmith, BMChen, RRichman, JGConnolly, DTColletti, SLTata, JRSemple, G Agonist lead identification for the high affinity niacin receptor GPR109a. Bioorg Med Chem Lett17:4914-9 (2007) 
 
Hydroxycarboxylic acid receptor 2
Name:Hydroxycarboxylic acid receptor 2
Type:G Protein-Coupled Receptor (GPCR)
Mol. Mass.:41868.22
Organism:Homo sapiens (Human)
Description:Membranes from CHO cells expressing the recombinant human GPR109A were used in competition binding assay.
Residue:363
BDBM50216537
NameBDBM50216537
Synonyms:3-benzyl-1H-pyrazole-5-carboxylic acid CHEMBL247317
TypeSmall organic molecule
Emp. Form.C11H10N2O2
Mol. Mass.202.2093
SMILESOC(=O)c1cc(Cc2ccccc2)[nH]n1