Reaction Details
TargetHydroxycarboxylic acid receptor 2
LigandBDBM23515
Substrate/Competitorn/a
Meas. Tech.ChEMBL_456679 (CHEMBL924060)
EC50 120±n/a nM
Citation Gharbaoui, TSkinner, PJShin, YJAverbuj, CJung, JKJohnson, BRDuong, TDecaire, MUy, JCherrier, MCWebb, PJTamura, SYZou, NRodriguez, NBoatman, PDSage, CRLindstrom, AXu, JSchrader, TOSmith, BMChen, RRichman, JGConnolly, DTColletti, SLTata, JRSemple, G Agonist lead identification for the high affinity niacin receptor GPR109a. Bioorg Med Chem Lett17:4914-9 (2007) 
 
Hydroxycarboxylic acid receptor 2
Name:Hydroxycarboxylic acid receptor 2
Type:G Protein-Coupled Receptor (GPCR)
Mol. Mass.:41868.22
Organism:Homo sapiens (Human)
Description:Membranes from CHO cells expressing the recombinant human GPR109A were used in competition binding assay.
Residue:363
BDBM23515
NameBDBM23515
Synonyms:CHEMBL573 Nicotinic Acid pyridine-3-carboxylic acid | wampocap
TypeSmall organic molecule
Emp. Form.C6H5NO2
Mol. Mass.123.1094
SMILESOC(=O)c1cccnc1