Reaction Details
TargetMetabotropic glutamate receptor 5
LigandBDBM50216770
Substrate/Competitorn/a
Meas. Tech.ChEMBL_447843 (CHEMBL898093)
IC50 17±n/a nM
Citation Milbank, JBKnauer, CSAugelli-Szafran, CESakkab-Tan, ATLin, KKYamagata, KHoffman, JKZhuang, NThomas, JGalatsis, PWendt, JAMickelson, JWSchwarz, RDKinsora, JJLotarski, SMStakich, KGillespie, KKLam, WWMutlib, AE Rational design of 7-arylquinolines as non-competitive metabotropic glutamate receptor subtype 5 antagonists. Bioorg Med Chem Lett17:4415-8 (2007) 
 
Metabotropic glutamate receptor 5
Name:Metabotropic glutamate receptor 5
Type:Enzyme
Mol. Mass.:131900.14
Organism:Rattus norvegicus (Rat)
Description:P31424
Residue:1203
BDBM50216770
NameBDBM50216770
Synonyms:3-ethoxy-5-(2-methylquinolin-7-yl)benzonitrile | CHEMBL233358
TypeSmall organic molecule
Emp. Form.C19H16N2O
Mol. Mass.288.3431
SMILESCCOc1cc(cc(c1)-c1ccc2ccc(C)nc2c1)C#N