Reaction Details
TargetMelanin-concentrating hormone receptor 1
LigandBDBM50217060
Substrate/Competitorn/a
Meas. Tech.ChEMBL_448548 (CHEMBL897698)
Ki 4±n/a nM
Citation Su, JTang, HMcKittrick, BAGu, HGuo, TQian, GBurnett, DAClader, JWGreenlee, WJHawes, BEO'neill, KSpar, BWeig, BKowalski, TSorota, S Synthesis of novel bicyclo[4.1.0]heptane and bicyclo[3.1.0]hexane derivatives as melanin-concentrating hormone receptor R1 antagonists. Bioorg Med Chem Lett17:4845-50 (2007) 
 
Melanin-concentrating hormone receptor 1
Name:Melanin-concentrating hormone receptor 1
Type:G Protein-Coupled Receptor (GPCR)
Mol. Mass.:45976.27
Organism:Homo sapiens (Human)
Description:Membranes from CHO-K1 cells stably expressing human MCH1R were used in assays.
Residue:422
BDBM50217060
NameBDBM50217060
Synonyms:1-((1S,2S,5S)-5-(2-(aminomethyl)thiazol-5-yl)bicyclo[3.1.0]hexan-2-yl)-3-(2,6-dichloropyridin-4-yl)-1-(3-((2R,5S)-2,5-dimethylpiperazin-1-yl)propyl)urea | CHEMBL391496
TypeSmall organic molecule
Emp. Form.C25H35Cl2N7OS
Mol. Mass.552.563
SMILESC[C@H]1CN(CCCN([C@H]2CC[C@@]3(C[C@H]23)c2cnc(CN)s2)C(=O)Nc2cc(Cl)nc(Cl)c2)[C@H](C)CN1