Reaction Details
TargetMelanin-concentrating hormone receptor 1
LigandBDBM50219038
Substrate/Competitorn/a
Meas. Tech.ChEMBL_445279 (CHEMBL893404)
Ki 8.5±n/a nM
Citation Jiang, YChen, CALu, KDaniewska, IDe Leon, JKong, RForray, CLi, BHegde, LGWolinsky, TDCraig, DAWetzel, JMAndersen, KMarzabadi, MR Synthesis and SAR investigations for novel melanin-concentrating hormone 1 receptor (MCH1) antagonists Part 1. The discovery of arylacetamides as viable replacements for the dihydropyrimidinone moiety of an HTS hit. J Med Chem50:3870-82 (2007) 
 
Melanin-concentrating hormone receptor 1
Name:Melanin-concentrating hormone receptor 1
Type:Enzyme Catalytic Domain
Mol. Mass.:39075.64
Organism:RAT
Description:Melanin Concentrating Hormone 1 GPR24 RAT::P97639
Residue:353
BDBM50219038
NameBDBM50219038
Synonyms:CHEMBL243507 | N-(3-{4-[3-(isobutylrylamino)phenyl]-1-piperidinyl}propyl)-2,2-diphenylheptanamide
TypeSmall organic molecule
Emp. Form.C37H49N3O2
Mol. Mass.567.8039
SMILESCCCCCC(C(=O)NCCCN1CCC(CC1)c1cccc(NC(=O)C(C)C)c1)(c1ccccc1)c1ccccc1