Reaction Details
TargetMelanin-concentrating hormone receptor 1
LigandBDBM50219026
Substrate/Competitorn/a
Meas. Tech.ChEMBL_445279 (CHEMBL893404)
Ki 1.4±n/a nM
Citation Jiang, YChen, CALu, KDaniewska, IDe Leon, JKong, RForray, CLi, BHegde, LGWolinsky, TDCraig, DAWetzel, JMAndersen, KMarzabadi, MR Synthesis and SAR investigations for novel melanin-concentrating hormone 1 receptor (MCH1) antagonists Part 1. The discovery of arylacetamides as viable replacements for the dihydropyrimidinone moiety of an HTS hit. J Med Chem50:3870-82 (2007) 
 
Melanin-concentrating hormone receptor 1
Name:Melanin-concentrating hormone receptor 1
Type:Enzyme Catalytic Domain
Mol. Mass.:39075.64
Organism:RAT
Description:Melanin Concentrating Hormone 1 GPR24 RAT::P97639
Residue:353
BDBM50219026
NameBDBM50219026
Synonyms:CHEMBL243338 | N-{3-[1-(3-{[bis(4-fluorophenyl)acetyl]amino}propyl)-4-piperidinyl]phenyl}-2-methylpropanamide
TypeSmall organic molecule
Emp. Form.C32H37F2N3O2
Mol. Mass.533.6519
SMILESCC(C)C(=O)Nc1cccc(c1)C1CCN(CCCNC(=O)C(c2ccc(F)cc2)c2ccc(F)cc2)CC1