Reaction Details
TargetMelanin-concentrating hormone receptor 1
LigandBDBM50219045
Substrate/Competitorn/a
Meas. Tech.ChEMBL_445304 (CHEMBL894445)
IC50 360±n/a nM
Citation Chen, CAJiang, YLu, KDaniewska, IMazza, CGNegron, LForray, CParola, TLi, BHegde, LGWolinsky, TDCraig, DAKong, RWetzel, JMAndersen, KMarzabadi, MR Synthesis and SAR investigations for novel melanin-concentrating hormone 1 receptor (MCH1) antagonists part 2: A hybrid strategy combining key fragments of HTS hits. J Med Chem50:3883-90 (2007) 
 
Melanin-concentrating hormone receptor 1
Name:Melanin-concentrating hormone receptor 1
Type:Enzyme Catalytic Domain
Mol. Mass.:39075.64
Organism:RAT
Description:Melanin Concentrating Hormone 1 GPR24 RAT::P97639
Residue:353
BDBM50219045
NameBDBM50219045
Synonyms:CHEMBL242003 | N-(5-{1-[4-(3,4-difluorophenoxy)benzyl]-4-piperidinyl}-4-methylphenyl)-2-methylpropanamide
TypeSmall organic molecule
Emp. Form.C29H32F2N2O2
Mol. Mass.478.5734
SMILESCC(C)C(=O)Nc1cc(ccc1C)C1CCN(Cc2ccc(Oc3ccc(F)c(F)c3)cc2)CC1