Reaction Details
TargetMelanin-concentrating hormone receptor 1
LigandBDBM50219056
Substrate/Competitorn/a
Meas. Tech.ChEMBL_445301 (CHEMBL894442)
Ki 200±n/a nM
Citation Chen, CAJiang, YLu, KDaniewska, IMazza, CGNegron, LForray, CParola, TLi, BHegde, LGWolinsky, TDCraig, DAKong, RWetzel, JMAndersen, KMarzabadi, MR Synthesis and SAR investigations for novel melanin-concentrating hormone 1 receptor (MCH1) antagonists part 2: A hybrid strategy combining key fragments of HTS hits. J Med Chem50:3883-90 (2007) 
 
Melanin-concentrating hormone receptor 1
Name:Melanin-concentrating hormone receptor 1
Type:Enzyme Catalytic Domain
Mol. Mass.:39075.64
Organism:RAT
Description:Melanin Concentrating Hormone 1 GPR24 RAT::P97639
Residue:353
BDBM50219056
NameBDBM50219056
Synonyms:CHEMBL244163 | N-(3-{1-[4-(4-chlorophenyl)-4-oxobutyl]-4-piperidinyl}phenyl)-cyclohexanecarboxamide
TypeSmall organic molecule
Emp. Form.C28H35ClN2O2
Mol. Mass.467.043
SMILESClc1ccc(cc1)C(=O)CCCN1CCC(CC1)c1cccc(NC(=O)C2CCCCC2)c1