Reaction Details
TargetD(2) dopamine receptor
LigandBDBM50219053
Substrate/Competitorn/a
Meas. Tech.ChEMBL_445303 (CHEMBL894444)
Ki 7400±n/a nM
Citation Chen, CAJiang, YLu, KDaniewska, IMazza, CGNegron, LForray, CParola, TLi, BHegde, LGWolinsky, TDCraig, DAKong, RWetzel, JMAndersen, KMarzabadi, MR Synthesis and SAR investigations for novel melanin-concentrating hormone 1 receptor (MCH1) antagonists part 2: A hybrid strategy combining key fragments of HTS hits. J Med Chem50:3883-90 (2007) 
 
D(2) dopamine receptor
Name:D(2) dopamine receptor
Type:Cell-surface receptors
Mol. Mass.:50647.10
Organism:Homo sapiens (Human)
Description:P14416
Residue:443
BDBM50219053
NameBDBM50219053
Synonyms:CHEMBL242004 SNAP-94847
TypeSmall organic molecule
Emp. Form.C29H32F2N2O2
Mol. Mass.478.5734
SMILESCC(C)C(=O)Nc1ccc(C)c(c1)C1CCN(Cc2ccc(Oc3ccc(F)c(F)c3)cc2)CC1