Reaction Details
TargetAlpha-1A adrenergic receptor
LigandBDBM50219049
Substrate/Competitorn/a
Meas. Tech.ChEMBL_445302 (CHEMBL894443)
Ki 150±n/a nM
Citation Chen, CAJiang, YLu, KDaniewska, IMazza, CGNegron, LForray, CParola, TLi, BHegde, LGWolinsky, TDCraig, DAKong, RWetzel, JMAndersen, KMarzabadi, MR Synthesis and SAR investigations for novel melanin-concentrating hormone 1 receptor (MCH1) antagonists part 2: A hybrid strategy combining key fragments of HTS hits. J Med Chem50:3883-90 (2007) 
 
Alpha-1A adrenergic receptor
Name:Alpha-1A adrenergic receptor
Type:Cell-surface receptors
Mol. Mass.:51511.67
Organism:Homo sapiens (Human)
Description:P35348
Residue:466
BDBM50219049
NameBDBM50219049
Synonyms:1-(4-Chloro-phenyl)-4-[4-(4-chloro-phenyl)-4-hydroxy-piperidin-1-yl]-butan-1-one CHEMBL363548
TypeSmall organic molecule
Emp. Form.C21H23Cl2NO2
Mol. Mass.392.319
SMILESOC1(CCN(CCCC(=O)c2ccc(Cl)cc2)CC1)c1ccc(Cl)cc1