Reaction Details
TargetD(2) dopamine receptor
LigandBDBM50219062
Substrate/Competitorn/a
Meas. Tech.ChEMBL_445303 (CHEMBL894444)
Ki 610±n/a nM
Citation Chen, CAJiang, YLu, KDaniewska, IMazza, CGNegron, LForray, CParola, TLi, BHegde, LGWolinsky, TDCraig, DAKong, RWetzel, JMAndersen, KMarzabadi, MR Synthesis and SAR investigations for novel melanin-concentrating hormone 1 receptor (MCH1) antagonists part 2: A hybrid strategy combining key fragments of HTS hits. J Med Chem50:3883-90 (2007) 
 
D(2) dopamine receptor
Name:D(2) dopamine receptor
Type:Cell-surface receptors
Mol. Mass.:50647.10
Organism:Homo sapiens (Human)
Description:P14416
Residue:443
BDBM50219062
NameBDBM50219062
Synonyms:CHEMBL394569 | N-(3-{1-[4-(4-chlorophenyl)-4-oxobutyl]-4-piperidinyl}phenyl)-2-methylpropanamide
TypeSmall organic molecule
Emp. Form.C25H31ClN2O2
Mol. Mass.426.979
SMILESCC(C)C(=O)Nc1cccc(c1)C1CCN(CCCC(=O)c2ccc(Cl)cc2)CC1