Reaction Details
TargetAlpha-1A adrenergic receptor
LigandBDBM50219053
Substrate/Competitorn/a
Meas. Tech.ChEMBL_445302 (CHEMBL894443)
Ki 180±n/a nM
Citation Chen, CAJiang, YLu, KDaniewska, IMazza, CGNegron, LForray, CParola, TLi, BHegde, LGWolinsky, TDCraig, DAKong, RWetzel, JMAndersen, KMarzabadi, MR Synthesis and SAR investigations for novel melanin-concentrating hormone 1 receptor (MCH1) antagonists part 2: A hybrid strategy combining key fragments of HTS hits. J Med Chem50:3883-90 (2007) 
 
Alpha-1A adrenergic receptor
Name:Alpha-1A adrenergic receptor
Type:Cell-surface receptors
Mol. Mass.:51511.67
Organism:Homo sapiens (Human)
Description:P35348
Residue:466
BDBM50219053
NameBDBM50219053
Synonyms:CHEMBL242004 SNAP-94847
TypeSmall organic molecule
Emp. Form.C29H32F2N2O2
Mol. Mass.478.5734
SMILESCC(C)C(=O)Nc1ccc(C)c(c1)C1CCN(Cc2ccc(Oc3ccc(F)c(F)c3)cc2)CC1