Reaction Details
TargetcAMP-specific 3',5'-cyclic phosphodiesterase 4B
LigandBDBM50219273
Substrate/Competitorn/a
Meas. Tech.ChEMBL_457129 (CHEMBL940738)
IC50 1.6±n/a nM
Citation Kuang, RShue, HJBlythin, DJShih, NYGu, DChen, XSchwerdt, JLin, LTing, PCZhu, XAslanian, RPiwinski, JJXiao, LPrelusky, DWu, PZhang, JZhang, XCelly, CSMinnicozzi, MBillah, MWang, P Discovery of a highly potent series of oxazole-based phosphodiesterase 4 inhibitors. Bioorg Med Chem Lett17:5150-4 (2007) 
 
cAMP-specific 3',5'-cyclic phosphodiesterase 4B
Name:cAMP-specific 3',5'-cyclic phosphodiesterase 4B
Type:Protein
Mol. Mass.:83318.87
Organism:Homo sapiens (Human)
Description:Q07343
Residue:736
BDBM50219273
NameBDBM50219273
Synonyms:(Z)-(5-(aminomethyl)-2-(8-methoxy-2-(trifluoromethyl)quinolin-5-yl)oxazol-4-yl)(4-((methoxyimino)(pyridin-2-yl)methyl)piperidin-1-yl)methanone | CHEMBL400976
TypeSmall organic molecule
Emp. Form.C28H27F3N6O4
Mol. Mass.568.547
SMILESCO\N=C(\C1CCN(CC1)C(=O)c1nc(oc1CN)-c1ccc(OC)c2nc(ccc12)C(F)(F)F)c1ccccn1