Reaction Details
TargetcAMP-specific 3',5'-cyclic phosphodiesterase 4B
LigandBDBM50219277
Substrate/Competitorn/a
Meas. Tech.ChEMBL_457129 (CHEMBL940738)
IC50 1.2±n/a nM
Citation Kuang, RShue, HJBlythin, DJShih, NYGu, DChen, XSchwerdt, JLin, LTing, PCZhu, XAslanian, RPiwinski, JJXiao, LPrelusky, DWu, PZhang, JZhang, XCelly, CSMinnicozzi, MBillah, MWang, P Discovery of a highly potent series of oxazole-based phosphodiesterase 4 inhibitors. Bioorg Med Chem Lett17:5150-4 (2007) 
 
cAMP-specific 3',5'-cyclic phosphodiesterase 4B
Name:cAMP-specific 3',5'-cyclic phosphodiesterase 4B
Type:Protein
Mol. Mass.:83318.87
Organism:Homo sapiens (Human)
Description:Q07343
Residue:736
BDBM50219277
NameBDBM50219277
Synonyms:4-(5-(aminomethyl)-2-(8-methoxy-2-(trifluoromethyl)quinolin-5-yl)oxazole-4-carbonyl)-N,N-dimethylpiperazine-1-sulfonamide | CHEMBL249933
TypeSmall organic molecule
Emp. Form.C22H25F3N6O5S
Mol. Mass.542.531
SMILESCOc1ccc(-c2nc(C(=O)N3CCN(CC3)S(=O)(=O)N(C)C)c(CN)o2)c2ccc(nc12)C(F)(F)F