Reaction Details
TargetDelta-type opioid receptor
LigandBDBM50219922
Substrate/Competitorn/a
Meas. Tech.ChEMBL_449062 (CHEMBL898267)
Ki 718±n/a nM
Citation Takeuchi, KHolloway, WGMcKinzie, JHSuter, TMStatnick, MASurface, PLEmmerson, PJThomas, EMSiegel, MGMatt, JEWolfe, CNMitch, CH Structure-activity relationship studies of carboxamido-biaryl ethers as opioid receptor antagonists (OpRAs). Part 1. Bioorg Med Chem Lett17:5349-52 (2007) 
 
Delta-type opioid receptor
Name:Delta-type opioid receptor
Type:G Protein-Coupled Receptor (GPCR)
Mol. Mass.:40382.98
Organism:Homo sapiens (Human)
Description:Competition binding assays were carried out using membrane preparations from transfected HN9.10 cells that constitutively expressed the delta opioid receptor.
Residue:372
BDBM50219922
NameBDBM50219922
Synonyms:CHEMBL396392 | N-methyl-6-(4-((phenethylamino)methyl)phenoxy)nicotinamide
TypeSmall organic molecule
Emp. Form.C22H23N3O2
Mol. Mass.361.4369
SMILESCNC(=O)c1ccc(Oc2ccc(CNCCc3ccccc3)cc2)nc1