Reaction Details
TargetMu-type opioid receptor
LigandBDBM50219921
Substrate/Competitorn/a
Meas. Tech.ChEMBL_449060 (CHEMBL899318)
Ki 0.290000±n/a nM
Citation Takeuchi, KHolloway, WGMcKinzie, JHSuter, TMStatnick, MASurface, PLEmmerson, PJThomas, EMSiegel, MGMatt, JEWolfe, CNMitch, CH Structure-activity relationship studies of carboxamido-biaryl ethers as opioid receptor antagonists (OpRAs). Part 1. Bioorg Med Chem Lett17:5349-52 (2007) 
 
Mu-type opioid receptor
Name:Mu-type opioid receptor
Type:G Protein-Coupled Receptor (GPCR)
Mol. Mass.:44789.51
Organism:Homo sapiens (Human)
Description:P35372
Residue:400
BDBM50219921
NameBDBM50219921
Synonyms:4-(4-((phenethylamino)methyl)phenoxy)benzamide | CHEMBL238317
TypeSmall organic molecule
Emp. Form.C22H22N2O2
Mol. Mass.346.4223
SMILESNC(=O)c1ccc(Oc2ccc(CNCCc3ccccc3)cc2)cc1