Reaction Details
TargetKappa-type opioid receptor
LigandBDBM50219911
Substrate/Competitorn/a
Meas. Tech.ChEMBL_449058 (CHEMBL899316)
Ki 24±n/a nM
Citation Takeuchi, KHolloway, WGMcKinzie, JHSuter, TMStatnick, MASurface, PLEmmerson, PJThomas, EMSiegel, MGMatt, JEWolfe, CNMitch, CH Structure-activity relationship studies of carboxamido-biaryl ethers as opioid receptor antagonists (OpRAs). Part 1. Bioorg Med Chem Lett17:5349-52 (2007) 
 
Kappa-type opioid receptor
Name:Kappa-type opioid receptor
Type:G Protein-Coupled Receptor (GPCR)
Mol. Mass.:42648.76
Organism:Homo sapiens (Human)
Description:P41145
Residue:380
BDBM50219911
NameBDBM50219911
Synonyms:6-(4-(2-(3-phenylpropylamino)ethyl)phenoxy)nicotinamide | CHEMBL236169
TypeSmall organic molecule
Emp. Form.C23H25N3O2
Mol. Mass.375.4635
SMILESNC(=O)c1ccc(Oc2ccc(CCNCCCc3ccccc3)cc2)nc1