Reaction Details
TargetMu-type opioid receptor
LigandBDBM50219912
Substrate/Competitorn/a
Meas. Tech.ChEMBL_449057 (CHEMBL899315)
Ki>2500±n/a nM
Citation Takeuchi, KHolloway, WGMcKinzie, JHSuter, TMStatnick, MASurface, PLEmmerson, PJThomas, EMSiegel, MGMatt, JEWolfe, CNMitch, CH Structure-activity relationship studies of carboxamido-biaryl ethers as opioid receptor antagonists (OpRAs). Part 1. Bioorg Med Chem Lett17:5349-52 (2007) 
 
Mu-type opioid receptor
Name:Mu-type opioid receptor
Type:G Protein-Coupled Receptor (GPCR)
Mol. Mass.:44789.51
Organism:Homo sapiens (Human)
Description:P35372
Residue:400
BDBM50219912
NameBDBM50219912
Synonyms:2-(4-(2-(benzylamino)ethyl)phenoxy)nicotinamide | CHEMBL236392
TypeSmall organic molecule
Emp. Form.C21H21N3O2
Mol. Mass.347.4103
SMILESNC(=O)c1cccnc1Oc1ccc(CCNCc2ccccc2)cc1