Reaction Details
TargetMu-type opioid receptor
LigandBDBM50219918
Substrate/Competitorn/a
Meas. Tech.ChEMBL_449057 (CHEMBL899315)
Ki 1.8±n/a nM
Citation Takeuchi, KHolloway, WGMcKinzie, JHSuter, TMStatnick, MASurface, PLEmmerson, PJThomas, EMSiegel, MGMatt, JEWolfe, CNMitch, CH Structure-activity relationship studies of carboxamido-biaryl ethers as opioid receptor antagonists (OpRAs). Part 1. Bioorg Med Chem Lett17:5349-52 (2007) 
 
Mu-type opioid receptor
Name:Mu-type opioid receptor
Type:G Protein-Coupled Receptor (GPCR)
Mol. Mass.:44789.51
Organism:Homo sapiens (Human)
Description:P35372
Residue:400
BDBM50219918
NameBDBM50219918
Synonyms:5-(4-((phenethylamino)methyl)phenoxy)picolinamide | CHEMBL236376
TypeSmall organic molecule
Emp. Form.C21H21N3O2
Mol. Mass.347.4103
SMILESNC(=O)c1ccc(Oc2ccc(CNCCc3ccccc3)cc2)cn1