Reaction Details
TargetKinesin-like protein KIF11
LigandBDBM50220180
Substrate/Competitorn/a
Meas. Tech.ChEMBL_446063 (CHEMBL895158)
Ki 3.5±n/a nM
Citation Parrish, CAAdams, NDAuger, KRBurgess, JLCarson, JDChaudhari, AMCopeland, RADiamond, MADonatelli, CADuffy, KJFaucette, LFFiner, JTHuffman, WFHugger, EDJackson, JRKnight, SDLuo, LMoore, MLNewlander, KARidgers, LHSakowicz, RShaw, ANSung, CMSutton, DWood, KWZhang, SYZimmerman, MNDhanak, D Novel ATP-competitive kinesin spindle protein inhibitors. J Med Chem50:4939-52 (2007) 
 
Kinesin-like protein KIF11
Name:Kinesin-like protein KIF11
Type:PROTEIN
Mol. Mass.:119138.97
Organism:Homo sapiens (Human)
Description:ChEMBL_1457426
Residue:1056
BDBM50220180
NameBDBM50220180
Synonyms:CHEMBL243669 | N-[3-fluoro-4'-(trifluoromethyl)-4-biphenylyl]sulfamide
TypeSmall organic molecule
Emp. Form.C13H10F4N2O2S
Mol. Mass.334.289
SMILESNS(=O)(=O)Nc1ccc(cc1F)-c1ccc(cc1)C(F)(F)F