Reaction Details
TargetKinesin-like protein KIF11
LigandBDBM50220179
Substrate/Competitorn/a
Meas. Tech.ChEMBL_446063 (CHEMBL895158)
IC50 176±n/a nM
Citation Parrish, CAAdams, NDAuger, KRBurgess, JLCarson, JDChaudhari, AMCopeland, RADiamond, MADonatelli, CADuffy, KJFaucette, LFFiner, JTHuffman, WFHugger, EDJackson, JRKnight, SDLuo, LMoore, MLNewlander, KARidgers, LHSakowicz, RShaw, ANSung, CMSutton, DWood, KWZhang, SYZimmerman, MNDhanak, D Novel ATP-competitive kinesin spindle protein inhibitors. J Med Chem50:4939-52 (2007) 
 
Kinesin-like protein KIF11
Name:Kinesin-like protein KIF11
Type:PROTEIN
Mol. Mass.:119138.97
Organism:Homo sapiens (Human)
Description:ChEMBL_1457426
Residue:1056
BDBM50220179
NameBDBM50220179
Synonyms:CHEMBL243906 | N-{4'-[(trifluoromethyl)sulfonyl]-4-biphenylyl}methanesulfonamide
TypeSmall organic molecule
Emp. Form.C14H12F3NO4S2
Mol. Mass.379.375
SMILESCS(=O)(=O)Nc1ccc(cc1)-c1ccc(cc1)S(=O)(=O)C(F)(F)F