Reaction Details
TargetKinesin-like protein KIF11
LigandBDBM50220178
Substrate/Competitorn/a
Meas. Tech.ChEMBL_446063 (CHEMBL895158)
IC50 262±n/a nM
Citation Parrish, CAAdams, NDAuger, KRBurgess, JLCarson, JDChaudhari, AMCopeland, RADiamond, MADonatelli, CADuffy, KJFaucette, LFFiner, JTHuffman, WFHugger, EDJackson, JRKnight, SDLuo, LMoore, MLNewlander, KARidgers, LHSakowicz, RShaw, ANSung, CMSutton, DWood, KWZhang, SYZimmerman, MNDhanak, D Novel ATP-competitive kinesin spindle protein inhibitors. J Med Chem50:4939-52 (2007) 
 
Kinesin-like protein KIF11
Name:Kinesin-like protein KIF11
Type:PROTEIN
Mol. Mass.:119138.97
Organism:Homo sapiens (Human)
Description:ChEMBL_1457426
Residue:1056
BDBM50220178
NameBDBM50220178
Synonyms:CHEMBL244510 | N-(4'-bromo-3,3'-difluoro-4-biphenylyl)urea
TypeSmall organic molecule
Emp. Form.C13H9BrF2N2O
Mol. Mass.327.124
SMILESNC(=O)Nc1ccc(cc1F)-c1ccc(Br)c(F)c1