Reaction Details
TargetCathepsin K
LigandBDBM50223910
Substrate/Competitorn/a
Meas. Tech.ChEMBL_458256 (CHEMBL924502)
IC50 2.3±n/a nM
Citation Teno, NMiyake, TEhara, TIrie, OSakaki, JOhmori, OGunji, HMatsuura, NMasuya, KHitomi, YNonomura, KHoriuchi, MGohda, KIwasaki, AUmemura, ITada, SKometani, MIwasaki, GCowan-Jacob, SWMissbach, MLattmann, RBetschart, C Novel scaffold for cathepsin K inhibitors. Bioorg Med Chem Lett17:6096-100 (2007) 
 
Cathepsin K
Name:Cathepsin K
Type:Enzyme
Mol. Mass.:36975.68
Organism:Homo sapiens (Human)
Description:P43235
Residue:329
BDBM50223910
NameBDBM50223910
Synonyms:6-(4-chlorobenzyl)-7-cyclohexyl-7H-pyrrolo[2,3-d]pyrimidine-2-carbonitrile | CHEMBL249367
TypeSmall organic molecule
Emp. Form.C20H19ClN4
Mol. Mass.350.845
SMILESClc1ccc(Cc2cc3cnc(nc3n2C2CCCCC2)C#N)cc1