Reaction Details
TargetCathepsin K
LigandBDBM50223935
Substrate/Competitorn/a
Meas. Tech.ChEMBL_458256 (CHEMBL924502)
IC50 1.1±n/a nM
Citation Teno, NMiyake, TEhara, TIrie, OSakaki, JOhmori, OGunji, HMatsuura, NMasuya, KHitomi, YNonomura, KHoriuchi, MGohda, KIwasaki, AUmemura, ITada, SKometani, MIwasaki, GCowan-Jacob, SWMissbach, MLattmann, RBetschart, C Novel scaffold for cathepsin K inhibitors. Bioorg Med Chem Lett17:6096-100 (2007) 
 
Cathepsin K
Name:Cathepsin K
Type:Enzyme
Mol. Mass.:36975.68
Organism:Homo sapiens (Human)
Description:P43235
Residue:329
BDBM50223935
NameBDBM50223935
Synonyms:CHEMBL399842 | N-(4-((2-cyano-7-neopentyl-7H-pyrrolo[2,3-d]pyrimidin-6-yl)methyl)phenyl)-2,2,2-trifluoroethanesulfonamide
TypeSmall organic molecule
Emp. Form.C21H22F3N5O2S
Mol. Mass.465.492
SMILESCC(C)(C)Cn1c(Cc2ccc(NS(=O)(=O)CC(F)(F)F)cc2)cc2cnc(nc12)C#N